Target
Sentrin-specific protease 1
Ligand
BDBM103830
Substrate
SUMO1
Meas. Tech.
SUMO Cleavage Assay
pH
7.4±0
IC50
>6.0e+4±n/a nM
Citation
 Madu, IGNamanja, ATSu, YWong, SLi, YJChen, Y Identification and Characterization of a New Chemotype of Noncovalent SENP Inhibitors. ACS Chem Biol 8:1435-41 (2013)  
Target
Name:
Sentrin-specific protease 1
Synonyms:
SENP1 Sentrin-specific protease 1 (SENP1)
Type:
Protein
Mol. Mass.:
73500.42
Organism:
Homo sapiens (Human)
Description:
Q9P0U3
Residue:
644
  
Inhibitor
Name:
BDBM103830
Synonyms:
SPI-05 US9791447, Compound SPI-05
Type:
Small organic molecule
Emp. Form.:
C34H26N6O6S2
Mol. Mass.:
678.737
SMILES:
Nc1ccc(\N=N\c2ccc(\C=C\c3ccc(cc3S(O)(=O)=O)\N=N\c3ccc(N)c4ccccc34)c(c2)S(O)(=O)=O)c2ccccc12
:
Substrate
Name:
Small ubiquitin-related modifier 1
Synonyms:
SMT3C SUMO1 Small ubiquitin-related modifier 1 | UBL1
Type:
Protein
Mol. Mass.:
11553.84
Organism:
Homo sapiens (Human)
Description:
Residue:
101