Target
Sentrin-specific protease 1
Ligand
BDBM103835
Substrate
SUMO2
Meas. Tech.
SUMO Cleavage Assay
pH
7.4±0
IC50
1.11e+4± 3.7e+3 nM
Citation
 Madu, IGNamanja, ATSu, YWong, SLi, YJChen, Y Identification and Characterization of a New Chemotype of Noncovalent SENP Inhibitors. ACS Chem Biol 8:1435-41 (2013)  
Target
Name:
Sentrin-specific protease 1
Synonyms:
SENP1 Sentrin-specific protease 1 (SENP1)
Type:
Protein
Mol. Mass.:
73500.42
Organism:
Homo sapiens (Human)
Description:
Q9P0U3
Residue:
644
  
Inhibitor
Name:
BDBM103835
Synonyms:
SPI-10 US9791447, Compound SPI-10
Type:
Small organic molecule
Emp. Form.:
C16H12N3O3S
Mol. Mass.:
326.35
SMILES:
Nc1ccc(\N=N\c2cccc(c2)S([O-])(=O)=O)c2ccccc12
:
Substrate
Name:
Small ubiquitin-related modifier 2
Synonyms:
SMT3B SUMO2 Small ubiquitin-related modifier 2
Type:
Protein
Mol. Mass.:
10869.09
Organism:
Homo sapiens (Human)
Description:
Residue:
95