Target
Sentrin-specific protease 2
Ligand
BDBM103831
Substrate
SUMO2
Meas. Tech.
SUMO Cleavage Assay
pH
7.4±0
IC50
1.07e+4± 1.6e+3 nM
Citation
 Madu, IGNamanja, ATSu, YWong, SLi, YJChen, Y Identification and Characterization of a New Chemotype of Noncovalent SENP Inhibitors. ACS Chem Biol 8:1435-41 (2013)  
Target
Name:
Sentrin-specific protease 2
Synonyms:
KIAA1331 SENP2_HUMAN | Sentrin-specific protease 2 (SENP2)
Type:
Protein
Mol. Mass.:
67890.62
Organism:
Homo sapiens (Human)
Description:
Q9HC62
Residue:
589
  
Inhibitor
Name:
BDBM103831
Synonyms:
SPI-06
Type:
Small organic molecule
Emp. Form.:
C17H15N3O3S
Mol. Mass.:
341.384
SMILES:
Cc1ccccc1\N=N\c1cc(c2ccccc2c1N)S(O)(=O)=O
:
Substrate
Name:
Small ubiquitin-related modifier 2
Synonyms:
SMT3B SUMO2 Small ubiquitin-related modifier 2
Type:
Protein
Mol. Mass.:
10869.09
Organism:
Homo sapiens (Human)
Description:
Residue:
95