Target
Sentrin-specific protease 2
Ligand
BDBM103833
Substrate
SUMO2
Meas. Tech.
SUMO Cleavage Assay
pH
7.4±0
IC50
4.106e+4± 5.2e+3 nM
Citation
 Madu, IGNamanja, ATSu, YWong, SLi, YJChen, Y Identification and Characterization of a New Chemotype of Noncovalent SENP Inhibitors. ACS Chem Biol 8:1435-41 (2013)  
Target
Name:
Sentrin-specific protease 2
Synonyms:
KIAA1331 SENP2_HUMAN | Sentrin-specific protease 2 (SENP2)
Type:
Protein
Mol. Mass.:
67890.62
Organism:
Homo sapiens (Human)
Description:
Q9HC62
Residue:
589
  
Inhibitor
Name:
BDBM103833
Synonyms:
SPI-08 US9791447, Compound SPI-08
Type:
Small organic molecule
Emp. Form.:
C16H12N3O3S
Mol. Mass.:
326.35
SMILES:
Nc1c(cc(c2ccccc12)S([O-])(=O)=O)\N=N\c1ccccc1
:
Substrate
Name:
Small ubiquitin-related modifier 2
Synonyms:
SMT3B SUMO2 Small ubiquitin-related modifier 2
Type:
Protein
Mol. Mass.:
10869.09
Organism:
Homo sapiens (Human)
Description:
Residue:
95