Target
Lysine-specific demethylase 4E
Ligand
BDBM103844
Substrate
Meas. Tech.
In vitro Hydroxylation Assays for PHD2 (AlphaScreen)
pH
7.5±0
IC50
>1.00e+5±n/a nM
Citation
 Chowdhury, RCandela-Lena, JIChan, MCGreenald, DJYeoh, KKTian, YMMcDonough, MATumber, ARose, NRConejo-Garcia, ADemetriades, MMathavan, SKawamura, ALee, MKvan Eeden, FPugh, CWRatcliffe, PJSchofield, CJ Selective Small Molecule Probes for the Hypoxia Inducible Factor (HIF) Prolyl Hydroxylases. ACS Chem Biol 8:1488-96 (2013)  
Target
Name:
Lysine-specific demethylase 4E
Synonyms:
2-OG-Dependent Histone Demethylase JMJD2E Jumonji domain-containing protein 2E (JMJD2E) KDM4DL KDM4E_HUMAN Lysine-specific demethylase 4E | Lysine-specific demethylase 4E (KDM4E)
Type:
Enzyme
Mol. Mass.:
56815.71
Organism:
Homo sapiens (Human)
Description:
B2RXH2
Residue:
506
  
Inhibitor
Name:
BDBM103844
Synonyms:
4HQ derivative 7
Type:
Small organic molecule
Emp. Form.:
C15H14N2O4
Mol. Mass.:
286.2827
SMILES:
OC(=O)CNC(=O)c1nc(CC=C)c2ccccc2c1O
: