Target
Lysine-specific demethylase 5C
Ligand
BDBM103845
Substrate
Meas. Tech.
In vitro Hydroxylation Assays for PHD2 (AlphaScreen)
pH
7.5±0
IC50
1.229e+5±n/a nM
Citation
 Chowdhury, RCandela-Lena, JIChan, MCGreenald, DJYeoh, KKTian, YMMcDonough, MATumber, ARose, NRConejo-Garcia, ADemetriades, MMathavan, SKawamura, ALee, MKvan Eeden, FPugh, CWRatcliffe, PJSchofield, CJ Selective Small Molecule Probes for the Hypoxia Inducible Factor (HIF) Prolyl Hydroxylases. ACS Chem Biol 8:1488-96 (2013)  
Target
Name:
Lysine-specific demethylase 5C
Synonyms:
DXS1272E JARID1C KDM5C Lysine-specific demethylase 5C (KDM5C) Protein SmcX SMCX | XE169
Type:
PROTEIN
Mol. Mass.:
175691.17
Organism:
Homo sapiens (Human)
Description:
P41229
Residue:
1560
  
Inhibitor
Name:
BDBM103845
Synonyms:
4HQ derivative 8
Type:
Small organic molecule
Emp. Form.:
C19H24N2O4
Mol. Mass.:
344.4049
SMILES:
CCCCCCCc1nc(C(=O)NCC(O)=O)c(O)c2ccccc12
: