Target
3-phosphoinositide-dependent protein kinase 1
Ligand
BDBM405828
Substrate
Meas. Tech.
Inhibitory Activity Assay
IC50
245±n/a nM
Citation
 Sestito, SDaniele, SMartini, CRapposelli, SPuricelli, G 2-oxo-1,2-dihydropyridine-3-carboxamide compounds and their use as inhibitors of PDK1 US Patent  US10351548 Publication Date 7/16/2019 
Target
Name:
3-phosphoinositide-dependent protein kinase 1
Synonyms:
3-Phosphoinositide-Dependent Protein Kinase 1 (PDK1) 3-phosphoinositide-dependent protein kinase 1 3-phosphoinositide-dependent protein kinase 1 (PDK-1) Isoform 2 of 3-phosphoinositide-dependent protein kinase 1 PDPK1 Phosphoinositide-dependent protein kinase 1 (PDK1) hPDK1
Type:
Enzyme
Mol. Mass.:
63157.65
Organism:
Homo sapiens (Human)
Description:
O15530
Residue:
556
  
Inhibitor
Name:
BDBM405828
Synonyms:
US10351548, Compound DD40
Type:
Small organic molecule
Emp. Form.:
C32H22F2N6O4
Mol. Mass.:
592.5517
SMILES:
Fc1ccc(Cn2cccc(C(=O)Nc3cccc(c3)C(=O)Nc3ccc4NC(=O)\C(=C/c5cnc[nH]5)c4c3)c2=O)cc1F
: