Target
Coagulation factor IX
Ligand
BDBM405944
Substrate
Meas. Tech.
TBD
IC50
1.17±n/a nM
Citation
 Meng, DLi, HYang, MRuiz, MDewnani, SVJian, TParker, Jr., DLZhang, TCampeau, LWood, HBXu, JBerger, RWu, JYOrr, RKWalsh, SPHarper, B Factor IXa inhibitors US Patent  US10351558 Publication Date 7/16/2019 
Target
Name:
Coagulation factor IX
Synonyms:
Christmas factor Coagulation factor IX/VIII Coagulation factor IXa heavy chain F9 Factor IX Factor IXa (fIXa) Plasma thromboplastin component
Type:
Enzyme
Mol. Mass.:
51768.83
Organism:
Homo sapiens (Human)
Description:
P00740
Residue:
461
  
Inhibitor
Name:
BDBM405944
Synonyms:
US10351558, Example 119
Type:
Small organic molecule
Emp. Form.:
C29H22Cl2FN5O3
Mol. Mass.:
578.421
SMILES:
OC(=O)Cn1c2CC[C@](Cc2c2ccc(Cl)cc12)(NC(=O)c1ccc(cc1Cl)-n1cnnc1)c1cccc(F)c1
: