Target
Coagulation factor IX
Ligand
BDBM405952
Substrate
Meas. Tech.
TBD
IC50
2.64±n/a nM
Citation
 Meng, DLi, HYang, MRuiz, MDewnani, SVJian, TParker, Jr., DLZhang, TCampeau, LWood, HBXu, JBerger, RWu, JYOrr, RKWalsh, SPHarper, B Factor IXa inhibitors US Patent  US10351558 Publication Date 7/16/2019 
Target
Name:
Coagulation factor IX
Synonyms:
Christmas factor Coagulation factor IX/VIII Coagulation factor IXa heavy chain F9 Factor IX Factor IXa (fIXa) Plasma thromboplastin component
Type:
Enzyme
Mol. Mass.:
51768.83
Organism:
Homo sapiens (Human)
Description:
P00740
Residue:
461
  
Inhibitor
Name:
BDBM405952
Synonyms:
US10351558, Example 127
Type:
Small organic molecule
Emp. Form.:
C29H26N6O2
Mol. Mass.:
490.5557
SMILES:
Cc1ccc2n3C[C@@](CCc3c(C(N)=O)c2c1)(NC(=O)c1ccc(cc1)-n1cnnc1)c1ccccc1
: