Target
Coagulation factor IX
Ligand
BDBM405969
Substrate
Meas. Tech.
TBD
IC50
1.85±n/a nM
Citation
 Meng, DLi, HYang, MRuiz, MDewnani, SVJian, TParker, Jr., DLZhang, TCampeau, LWood, HBXu, JBerger, RWu, JYOrr, RKWalsh, SPHarper, B Factor IXa inhibitors US Patent  US10351558 Publication Date 7/16/2019 
Target
Name:
Coagulation factor IX
Synonyms:
Christmas factor Coagulation factor IX/VIII Coagulation factor IXa heavy chain F9 Factor IX Factor IXa (fIXa) Plasma thromboplastin component
Type:
Enzyme
Mol. Mass.:
51768.83
Organism:
Homo sapiens (Human)
Description:
P00740
Residue:
461
  
Inhibitor
Name:
BDBM405969
Synonyms:
US10351558, Example 144
Type:
Small organic molecule
Emp. Form.:
C31H28ClN5O2
Mol. Mass.:
538.039
SMILES:
CC(=O)c1c2CC[C@](Cn2c2ccc(C)cc12)(NC(=O)c1ccc(cc1Cl)-n1cnc(C)n1)c1ccccc1
: