Target
Coagulation factor IX
Ligand
BDBM50126956
Substrate
Meas. Tech.
TBD
IC50
1.45±n/a nM
Citation
 Meng, DLi, HYang, MRuiz, MDewnani, SVJian, TParker, Jr., DLZhang, TCampeau, LWood, HBXu, JBerger, RWu, JYOrr, RKWalsh, SPHarper, B Factor IXa inhibitors US Patent  US10351558 Publication Date 7/16/2019 
Target
Name:
Coagulation factor IX
Synonyms:
Christmas factor Coagulation factor IX/VIII Coagulation factor IXa heavy chain F9 Factor IX Factor IXa (fIXa) Plasma thromboplastin component
Type:
Enzyme
Mol. Mass.:
51768.83
Organism:
Homo sapiens (Human)
Description:
P00740
Residue:
461
  
Inhibitor
Name:
BDBM50126956
Synonyms:
CHEMBL3628961 | US10351558, Example 174
Type:
Small organic molecule
Emp. Form.:
C29H24Cl2N6O2
Mol. Mass.:
559.446
SMILES:
Cc1ccc2n3C[C@@](CCc3c(C(N)=O)c2c1)(NC(=O)c1c(Cl)cc(cc1Cl)-n1cnnc1)c1ccccc1
: