Target
Complement factor D
Ligand
BDBM109944
Substrate
Meas. Tech.
Human Factor D Assay
pH
7.5±n/a
Temperature
298.15±n/a K
IC50
<1000±n/a nM
Comments
extracted
Citation
 Wiles, JAWang, QGadhachanda, VRPais, GHashimoto, AChen, DWang, XAgarwal, ADeshpande, MPhadke, AS Amide compounds for treatment of complement mediated disorders US Patent  US9695205 Publication Date 7/4/2017 
Target
Name:
Complement factor D
Synonyms:
Adipsin CFAD_HUMAN DF Properdin factor D
Type:
Protein
Mol. Mass.:
27039.19
Organism:
Homo sapiens (Human)
Description:
P00746
Residue:
253
  
Inhibitor
Name:
BDBM109944
Synonyms:
US9695205, 25
Type:
Small organic molecule
Emp. Form.:
C26H21F5N8O6
Mol. Mass.:
636.487
SMILES:
NC(=O)c1nn(CC(=O)N2C[C@H](F)C[C@H]2C(=O)Nc2cccc(OC(F)(F)F)c2F)c2ccc(NC(=O)Nc3ccon3)cc12
: