Target
Dimer of Gag-Pol polyprotein [489-587]
Ligand
BDBM4216
Substrate
HIV Protease Peptide Substrate
Meas. Tech.
Protease Inhibition Assay
pH
4.7±n/a
Temperature
310.15±n/a K
Ki
1±n/a nM
Citation
 Komai, THigashida, SSakurai, MNitta, TKasuya, AMiyamaoto, SYagi, ROzawa, YHanda, HMohri, HYasuoka, AOka, SNishigaki, TKimura, SShimada, KYabe, Y Structure-activity relationships of HIV-1 PR inhibitors containing AHPBA--II. Modification of pyrrolidine ring at P1' proline. Bioorg Med Chem 4:1365-77 (1996)  
Target
Name:
Dimer of Gag-Pol polyprotein [489-587]
Synonyms:
HIV-1 Protease
Type:
Protein Complex
Mol. Mass.:
Description:
Components:
This complex has 2 components.
Component 1
Name:
Gag-Pol polyprotein [489-587]
Synonyms:
HIV protease HIV-1 Protease chain A POL_HV1N5 | gag-pol
Type:
Enzyme Subunit
Mol. Mass.:
10822.21
Organism:
Human immunodeficiency virus type 1
Description:
P12497[489-587]
Residue:
99
  
Component 2
Name:
Gag-Pol polyprotein [489-587]
Synonyms:
HIV protease HIV-1 Protease chain A POL_HV1N5 | gag-pol
Type:
Enzyme Subunit
Mol. Mass.:
10822.21
Organism:
Human immunodeficiency virus type 1
Description:
P12497[489-587]
Residue:
99
  
Inhibitor
Name:
BDBM4216
Synonyms:
AHPBA 24a benzyl N-[(1S)-1-{[(2S,3S)-4-[(2S)-2-(tert-butylcarbamoyl)-4-hydroxypyrrolidin-1-yl]-3-hydroxy-4-oxo-1-phenylbutan-2-yl]carbamoyl}-2-carbamoylethyl]carbamate
Type:
Small organic molecule
Emp. Form.:
C31H41N5O8
Mol. Mass.:
611.6859
SMILES:
CC(C)(C)NC(=O)[C@@H]1CC(O)CN1C(=O)[C@@H](O)[C@H](Cc1ccccc1)NC(=O)[C@H](CC(N)=O)NC(=O)OCc1ccccc1
:
Substrate
Name:
HIV Protease Peptide Substrate
Synonyms:
Type:
Peptide
Mol. Mass.:
2686.50
Organism:
Description:
Residue:
24