Target
Ectonucleotide pyrophosphatase/phosphodiesterase family member 2
Ligand
BDBM103566
Substrate
IC50
1100±0.0 nM
Citation
 Kawaguchi, MOkabe, TOkudaira, SNishimasu, HIshitani, RKojima, HNureki, OAoki, JNagano, T Screening and X-ray crystal structure-based optimization of autotaxin (ENPP2) inhibitors, using a newly developed fluorescence probe. ACS Chem Biol 8:1713-21 (2013)  
Target
Name:
Ectonucleotide pyrophosphatase/phosphodiesterase family member 2
Synonyms:
Autotaxin ENPP2_MOUSE Ectonucleotide pyrophosphatase/phosphodiesterase family member 2 Npps2 | Pdnp2
Type:
PROTEIN
Mol. Mass.:
98896.47
Organism:
Mus musculus
Description:
Residue:
862
  
Inhibitor
Name:
BDBM103566
Synonyms:
US8551988, 54
Type:
Small organic molecule
Emp. Form.:
C19H15ClN4O6S
Mol. Mass.:
462.864
SMILES:
Oc1ccc(CN=Nc2ccc(ON=O)cc2S(=O)(=O)Nc2ccc(Cl)cc2)cc1O
: