Target
Neutrophil gelatinase-associated lipocalin
Ligand
BDBM104011
Substrate
Meas. Tech.
Fluorescence quenching titrations
pH
7.4±n/a
Kd
34±4 nM
Citation
 Allred, BECorrenti, CClifton, MCStrong, RKRaymond, KN Siderocalin outwits the coordination chemistry of vibriobactin, a siderophore of Vibrio cholerae. ACS Chem Biol 8:1882-7 (2013)  
Target
Name:
Neutrophil gelatinase-associated lipocalin
Synonyms:
HNL NGAL Siderocalin (Scn)
Type:
Protein
Mol. Mass.:
22594.34
Organism:
Homo sapiens (Human)
Description:
P80188
Residue:
198
  
Inhibitor
Name:
BDBM104011
Synonyms:
Fluvibactin
Type:
Small organic molecule
Emp. Form.:
C31H34N4O10
Mol. Mass.:
622.6225
SMILES:
C[C@H]1OC(=N[C@@H]1C(=O)N(CCCNC(=O)c1cccc(O)c1O)CCCNC(=O)c1cccc(O)c1O)c1cccc(O)c1O
: