Target
Protein disulfide-isomerase
Ligand
BDBM104061
Substrate
Meas. Tech.
PDI Inhibition Assay
pH
7±n/a
IC50
2.2e+3± 4e+2 nM
Comments
extracted
Citation
 Ge, JZhang, CJLi, LChong, LMWu, XHao, PSze, SKYao, SQ Small molecule probe suitable for in situ profiling and inhibition of protein disulfide isomerase. ACS Chem Biol 8:2577-85 (2013)  
Target
Name:
Protein disulfide-isomerase
Synonyms:
Cellular thyroid hormone-binding protein P4HB PDIA1 PO4DB | Protein Disulfide-Isomerase (PDI)
Type:
Protein
Mol. Mass.:
57084.91
Organism:
Homo sapiens (Human)
Description:
P07237
Residue:
508
  
Inhibitor
Name:
BDBM104061
Synonyms:
PDI inhibitor P24
Type:
Small organic molecule
Emp. Form.:
C23H24N2O5S
Mol. Mass.:
440.512
SMILES:
C=CS(=O)(=O)Oc1ccc(C[C@H](NC(=O)CCc2ccccc2)C(=O)NCC#C)cc1
: