Target
Death-associated protein kinase 1
Ligand
BDBM104065
Substrate
Meas. Tech.
Kinome Profiling
Kd
300±0.0 nM
Citation
 Carlson, DAFranke, ASWeitzel, DHSpeer, BLHughes, PFHagerty, LFortner, CNVeal, JMBarta, TEZieba, BJSomlyo, AVSutherland, CDeng, JTWalsh, MPMacdonald, JAHaystead, TA Fluorescence Linked Enzyme Chemoproteomic Strategy for Discovery of a Potent and Selective DAPK1 and ZIPK Inhibitor. ACS Chem Biol 8:2715-23 (2013)  
Target
Name:
Death-associated protein kinase 1
Synonyms:
Cellular tumor antigen p53/Death-associated protein kinase 1 DAPK DAPK1_HUMAN Death-associated protein kinase 1 (DAPK1) Death-associated protein kinase 3 (DAPK3)
Type:
PROTEIN
Mol. Mass.:
160053.35
Organism:
Homo sapiens (Human)
Description:
ChEMBL_1517177
Residue:
1430
  
Inhibitor
Name:
BDBM104065
Synonyms:
HS38
Type:
Small organic molecule
Emp. Form.:
C14H12ClN5O2S
Mol. Mass.:
349.795
SMILES:
CC(Sc1nc2n(ncc2c(=O)[nH]1)-c1cccc(Cl)c1)C(N)=O
: