Target
DNA polymerase beta
Ligand
BDBM104080
Substrate
Meas. Tech.
DNA Pol β PEX Assay
pH
7.9±n/a
IC50
>5.0e+4±n/a nM
Comments
extracted
Citation
 Strittmatter, TBrockmann, APott, MHantusch, ABrunner, TMarx, A Expanding the Scope of Human DNA Polymerase ¿ and ß Inhibitors. ACS Chem Biol 9:282-90 (2014)  
Target
Name:
DNA polymerase beta
Synonyms:
DNA polymerase beta (Pol β) POLB
Type:
Protein
Mol. Mass.:
38188.76
Organism:
Homo sapiens (Human)
Description:
Residue:
335
  
Inhibitor
Name:
BDBM104080
Synonyms:
(Z)-5-(3-Bromo-4-(p-tolylthio)benzylidene)-2-thioxothiazolidin-4-one 14 | DNA polymerase inhibitor 14
Type:
Small organic molecule
Emp. Form.:
C17H12BrNOS3
Mol. Mass.:
422.382
SMILES:
Cc1ccc(Sc2ccc(C=C3SC(S)=NC3=O)cc2Br)cc1
: