Target
DNA polymerase beta
Ligand
BDBM104081
Substrate
Meas. Tech.
DNA Pol β PEX Assay
pH
7.9±n/a
IC50
2.81e+4±n/a nM
Comments
extracted
Citation
 Strittmatter, TBrockmann, APott, MHantusch, ABrunner, TMarx, A Expanding the Scope of Human DNA Polymerase ¿ and ß Inhibitors. ACS Chem Biol 9:282-90 (2014)  
Target
Name:
DNA polymerase beta
Synonyms:
DNA polymerase beta (Pol β) POLB
Type:
Protein
Mol. Mass.:
38188.76
Organism:
Homo sapiens (Human)
Description:
Residue:
335
  
Inhibitor
Name:
BDBM104081
Synonyms:
(Z)-2-Thioxo-5-(4-(p-tolylthio)-3- (trifluoromethyl)benzylidene)thiazolidin-4-one 15 | DNA polymerase inhibitor 15
Type:
Small organic molecule
Emp. Form.:
C18H12F3NOS3
Mol. Mass.:
411.484
SMILES:
Cc1ccc(Sc2ccc(C=C3SC(S)=NC3=O)cc2C(F)(F)F)cc1
: