Target
DNA polymerase lambda
Ligand
BDBM104093
Substrate
Meas. Tech.
DNA Pol λ PEX Assay
pH
7.5±n/a
IC50
4.0e+3±n/a nM
Comments
extracted
Citation
 Strittmatter, TBrockmann, APott, MHantusch, ABrunner, TMarx, A Expanding the Scope of Human DNA Polymerase ¿ and ß Inhibitors. ACS Chem Biol 9:282-90 (2014)  
Target
Name:
DNA polymerase lambda
Synonyms:
DNA polymerase lambda (Pol λ) POLL
Type:
Protein
Mol. Mass.:
63493.10
Organism:
Homo sapiens (Human)
Description:
Residue:
575
  
Inhibitor
Name:
BDBM104093
Synonyms:
(Z)-5-(3-Bromo-4-((3-fluoro-4-methylphenyl)thio)benzylidene)-2- thioxothiazolidin-4-one 27 | DNA polymerase inhibitor 27
Type:
Small organic molecule
Emp. Form.:
C17H11BrFNOS3
Mol. Mass.:
440.373
SMILES:
Cc1ccc(Sc2ccc(C=C3SC(S)=NC3=O)cc2Br)cc1F
: