Target
DNA polymerase lambda
Ligand
BDBM104094
Substrate
Meas. Tech.
DNA Pol λ PEX Assay
pH
7.5±n/a
IC50
<1.0e+4±n/a nM
Comments
extracted
Citation
 Strittmatter, TBrockmann, APott, MHantusch, ABrunner, TMarx, A Expanding the Scope of Human DNA Polymerase ¿ and ß Inhibitors. ACS Chem Biol 9:282-90 (2014)  
Target
Name:
DNA polymerase lambda
Synonyms:
DNA polymerase lambda (Pol λ) POLL
Type:
Protein
Mol. Mass.:
63493.10
Organism:
Homo sapiens (Human)
Description:
Residue:
575
  
Inhibitor
Name:
BDBM104094
Synonyms:
23 (Z)-2-Thioxo-5-(4-(o-tolylthio)benzylidene)thiazolidin-4-one 28 | DNA polymerase inhibitor 28
Type:
Small organic molecule
Emp. Form.:
C17H13NOS3
Mol. Mass.:
343.486
SMILES:
Cc1ccccc1Sc1ccc(C=C2SC(S)=NC2=O)cc1
: