Target
AP2-associated protein kinase 1
Ligand
BDBM311159
Substrate
Meas. Tech.
AAK1 Kinase Assay
IC50
0.420±n/a nM
Citation
 Luo, G Biaryl kinase inhibitors US Patent  US10351563 Publication Date 7/16/2019 
Target
Name:
AP2-associated protein kinase 1
Synonyms:
AAK1 Adaptor-associated kinase 1 | KIAA1048
Type:
PROTEIN
Mol. Mass.:
103884.23
Organism:
Homo sapiens (Human)
Description:
ChEMBL_774569
Residue:
961
  
Inhibitor
Name:
BDBM311159
Synonyms:
(S)-N-(4-(4-((2-amino-4-methylpentyl)oxy)-3-methylphenyl)pyridin-2-yl)acetamide BDBM50243381 US10723734, Example 7 | US9902722, Example 7
Type:
Small organic molecule
Emp. Form.:
C20H27N3O2
Mol. Mass.:
341.4473
SMILES:
CC(C)C[C@H](N)COc1ccc(cc1C)-c1ccnc(NC(C)=O)c1
: