Target
AP2-associated protein kinase 1
Ligand
BDBM311180
Substrate
Meas. Tech.
AAK1 Kinase Assay
IC50
0.630±n/a nM
Citation
 Luo, G Biaryl kinase inhibitors US Patent  US10351563 Publication Date 7/16/2019 
Target
Name:
AP2-associated protein kinase 1
Synonyms:
AAK1 Adaptor-associated kinase 1 | KIAA1048
Type:
PROTEIN
Mol. Mass.:
103884.23
Organism:
Homo sapiens (Human)
Description:
ChEMBL_774569
Residue:
961
  
Inhibitor
Name:
BDBM311180
Synonyms:
(S)-methyl (4-(4-((2-amino-2,4-dimethylpentyl)oxy)-3-(difluoromethyl)phenyl)pyridin-2-yl)carbamate US10351563, Example 24 US10723734, Example 24 US9902722, Example 24
Type:
Small organic molecule
Emp. Form.:
C21H27F2N3O3
Mol. Mass.:
407.4542
SMILES:
COC(=O)Nc1cc(ccn1)-c1ccc(OC[C@@](C)(N)CC(C)C)c(c1)C(F)F
: