Target
AP2-associated protein kinase 1
Ligand
BDBM311185
Substrate
Meas. Tech.
AAK1 Kinase Assay
IC50
0.670±n/a nM
Citation
 Luo, G Biaryl kinase inhibitors US Patent  US10351563 Publication Date 7/16/2019 
Target
Name:
AP2-associated protein kinase 1
Synonyms:
AAK1 Adaptor-associated kinase 1 | KIAA1048
Type:
PROTEIN
Mol. Mass.:
103884.23
Organism:
Homo sapiens (Human)
Description:
ChEMBL_774569
Residue:
961
  
Inhibitor
Name:
BDBM311185
Synonyms:
US10155760, Example 29 US10544120, Example 29 US10981910, Example 29 | methyl (4-(4-((2-amino-2,4-dimethylpentyl)oxy)-3-chlorophenyl)pyridin-2-yl)carbamate
Type:
Small organic molecule
Emp. Form.:
C21H25BrClNO3
Mol. Mass.:
454.785
SMILES:
CC(C)CC(C)(COc1ccc(Br)cc1Cl)NC(=O)OCc1ccccc1
: