Target
AP2-associated protein kinase 1
Ligand
BDBM311229
Substrate
Meas. Tech.
AAK1 Kinase Assay
IC50
0.320±n/a nM
Citation
 Luo, G Biaryl kinase inhibitors US Patent  US10351563 Publication Date 7/16/2019 
Target
Name:
AP2-associated protein kinase 1
Synonyms:
AAK1 Adaptor-associated kinase 1 | KIAA1048
Type:
PROTEIN
Mol. Mass.:
103884.23
Organism:
Homo sapiens (Human)
Description:
ChEMBL_774569
Residue:
961
  
Inhibitor
Name:
BDBM311229
Synonyms:
(S)-1-(4-(1,6-naphthyridin-4-yl)-2-(trifluoromethyl)phenoxy)-2,4-dimethylpentan-2-amine US10351563, Example 85 US10723734, Example 85 US9902722, Example 85
Type:
Small organic molecule
Emp. Form.:
C22H24F3N3O
Mol. Mass.:
403.4407
SMILES:
CC(C)C[C@](C)(N)COc1ccc(cc1C(F)(F)F)-c1ccnc2ccncc12
: