Target
AP2-associated protein kinase 1
Ligand
BDBM311347
Substrate
Meas. Tech.
AAK1 Kinase Assay
IC50
0.230±n/a nM
Citation
 Luo, G Biaryl kinase inhibitors US Patent  US10351563 Publication Date 7/16/2019 
Target
Name:
AP2-associated protein kinase 1
Synonyms:
AAK1 Adaptor-associated kinase 1 | KIAA1048
Type:
PROTEIN
Mol. Mass.:
103884.23
Organism:
Homo sapiens (Human)
Description:
ChEMBL_774569
Residue:
961
  
Inhibitor
Name:
BDBM311347
Synonyms:
(S)-1-((3-(difluoromethyl)-5-(quinolin-4-yl)pyridin-2-yl)oxy)-2,4-dimethylpentan-2-amine US10351563, Example 204 US10723734, Example 204 US9902722, Example 204
Type:
Small organic molecule
Emp. Form.:
C22H25F2N3O
Mol. Mass.:
385.4502
SMILES:
CC(C)C[C@](C)(N)COc1ncc(cc1C(F)F)-c1ccnc2ccccc12
: