Target
Tyrosine-protein kinase JAK1
Ligand
BDBM281357
Substrate
Meas. Tech.
JAK Caliper Enzyme Assay at 1 mM ATP
pH
7.4±n/a
Temperature
298.15±n/a K
IC50
3.40±n/a nM
Comments
extracted
Citation
 Coe, JWDehnhardt, CMJones, PSabnis, YAStrohbach, JWWakenhut, FMWhitlock, GA Pyrazolopyridines and pyrazolopyrimidines US Patent  US10022376 Publication Date 7/17/2018 
Target
Name:
Tyrosine-protein kinase JAK1
Synonyms:
JAK-1 JAK1A JAK1_HUMAN Janus kinase 1 (JAK1) | Janus kinase 1 JAK1
Type:
Protein
Mol. Mass.:
133293.73
Organism:
Homo sapiens (Human)
Description:
P23458
Residue:
1154
  
Inhibitor
Name:
BDBM281357
Synonyms:
4-({2-[ethyl(ethylsulfonyl)-amino]benzyl}amino)-6-(2-ethyl-5-fluoro-4-hydroxyphenyl)-N-methyl-1H-pyrazolo[4,3-c]pyridine-3-carboxamide | US10022376, Example 2
Type:
Small organic molecule
Emp. Form.:
C27H31FN6O4S
Mol. Mass.:
554.636
SMILES:
CCN(c1ccccc1CNc1nc(cc2[nH]nc(C(=O)NC)c12)-c1cc(F)c(O)cc1CC)S(=O)(=O)CC
: