Target
Tyrosine-protein kinase JAK1
Ligand
BDBM281386
Substrate
Meas. Tech.
JAK Caliper Enzyme Assay at 1 mM ATP
pH
7.4±n/a
Temperature
298.15±n/a K
IC50
3.30±n/a nM
Comments
extracted
Citation
 Coe, JWDehnhardt, CMJones, PSabnis, YAStrohbach, JWWakenhut, FMWhitlock, GA Pyrazolopyridines and pyrazolopyrimidines US Patent  US10022376 Publication Date 7/17/2018 
Target
Name:
Tyrosine-protein kinase JAK1
Synonyms:
JAK-1 JAK1A JAK1_HUMAN Janus kinase 1 (JAK1) | Janus kinase 1 JAK1
Type:
Protein
Mol. Mass.:
133293.73
Organism:
Homo sapiens (Human)
Description:
P23458
Residue:
1154
  
Inhibitor
Name:
BDBM281386
Synonyms:
US10022376, Example 77 | US10022376, Example 98
Type:
Small organic molecule
Emp. Form.:
C24H22F4N6O4S
Mol. Mass.:
566.528
SMILES:
CN(c1ccccc1CNc1nc(cc2[nH]nc(C(N)=O)c12)-c1cc(F)c(O)cc1CC(F)(F)F)S(C)(=O)=O
: