Target
Tyrosine-protein kinase JAK1
Ligand
BDBM281415
Substrate
Meas. Tech.
JAK Caliper Enzyme Assay at 1 mM ATP
pH
7.4±n/a
Temperature
298.15±n/a K
IC50
2.90±n/a nM
Comments
extracted
Citation
 Coe, JWDehnhardt, CMJones, PSabnis, YAStrohbach, JWWakenhut, FMWhitlock, GA Pyrazolopyridines and pyrazolopyrimidines US Patent  US10022376 Publication Date 7/17/2018 
Target
Name:
Tyrosine-protein kinase JAK1
Synonyms:
JAK-1 JAK1A JAK1_HUMAN Janus kinase 1 (JAK1) | Janus kinase 1 JAK1
Type:
Protein
Mol. Mass.:
133293.73
Organism:
Homo sapiens (Human)
Description:
P23458
Residue:
1154
  
Inhibitor
Name:
BDBM281415
Synonyms:
6-[5-fluoro-4-hydroxy-2-(2,2,2-trifluoroeth-yl)phenyl]-4-({2-[(2-hydroxyethyl)-(methyl-sulfonyl)amino]ben-zyl}amino)-N-methyl-1H-pyrazolo[4,3-c]pyridine-3-carboxamide | US10022376, Example 24
Type:
Small organic molecule
Emp. Form.:
C26H26F4N6O5S
Mol. Mass.:
610.58
SMILES:
CNC(=O)c1n[nH]c2cc(nc(NCc3ccccc3N(CCO)S(C)(=O)=O)c12)-c1cc(F)c(O)cc1CC(F)(F)F
: