Target
5-hydroxytryptamine receptor 6
Ligand
BDBM104382
Substrate
Meas. Tech.
Binding Assay
Ki
0.31±0.0 nM
Citation
 Guzzo, PRHenderson, AJNacro, KIsherwood, MLGhosh, AXiang, K Epiminocycloalkyl[b] indole derivatives as serotonin sub-type 6 (5-HT6) modulators and uses thereof US Patent  US8575186 Publication Date 11/5/2013 
Target
Name:
5-hydroxytryptamine receptor 6
Synonyms:
5-HT-6 5-hydroxytryptamine receptor 6 (5-HT-6) 5-hydroxytryptamine receptor 6 (5HT6) HTR6 Serotonin 6 (5-HT6) receptor | Serotonin Receptor 6
Type:
G Protein-Coupled Receptor (GPCR)
Mol. Mass.:
46968.43
Organism:
Homo sapiens (Human)
Description:
P50406
Residue:
440
  
Inhibitor
Name:
BDBM104382
Synonyms:
US8575186, 145
Type:
Small organic molecule
Emp. Form.:
C23H23N3O3S
Mol. Mass.:
421.512
SMILES:
COc1cc(cc2c3C4CCC(Cc3n(C)c12)N4)S(=O)(=O)c1ccc2[nH]ccc2c1
: