Target
Orexin/Hypocretin receptor type 1
Ligand
BDBM104697
Substrate
Meas. Tech.
Radioligand Binding Assay
Ki
1.8±0.0 nM
Citation
 Breslin, MJColeman, PJCox, CDSchreier, JD Pyridyl piperidine orexin receptor antagonists US Patent  US8569311 Publication Date 10/29/2013 
Target
Name:
Orexin/Hypocretin receptor type 1
Synonyms:
Hcrtr1 OX1R_RAT Orexin receptor type 1 (OX1R) Ox1-R | Ox1R
Type:
Protein
Mol. Mass.:
46817.55
Organism:
Rattus norvegicus (Rat)
Description:
P56718
Residue:
416
  
Inhibitor
Name:
BDBM104697
Synonyms:
US8569311, 1-1
Type:
Small organic molecule
Emp. Form.:
C23H24FN3O2S
Mol. Mass.:
425.519
SMILES:
C[C@@H]1CC[C@@H](COc2ccc(F)cn2)CN1C(=O)c1cc(C)ccc1-c1nccs1
: