Target
Suppressor of tumorigenicity 14 protein
Ligand
BDBM104906
Substrate
Meas. Tech.
Inhibition Assay
Ki
4.2±0.0 nM
Citation
 Steinmetzer, TSchweinitz, ADonnecke, D Meta-substituted phenyl sulfonyl amides of secondary amino acid amides, the production thereof, and use thereof as matriptase inhibitors US Patent  US8569313 Publication Date 10/29/2013 
Target
Name:
Suppressor of tumorigenicity 14 protein
Synonyms:
Epithin MT-SP1 PRSS14 SNC19 ST14_HUMAN Suppressor of tumorigenicity 14 protein TADG15
Type:
Single-pass type II membrane protein
Mol. Mass.:
94769.23
Organism:
Homo sapiens (Human)
Description:
Q9Y5Y6
Residue:
855
  
Inhibitor
Name:
BDBM104906
Synonyms:
US8569313, Inhibitor 14
Type:
Small organic molecule
Emp. Form.:
C28H35N7O3S
Mol. Mass.:
549.688
SMILES:
NCCC1CCN(CC1)C(=O)C(Cc1cccc(c1)C(N)=N)NS(=O)(=O)c1cccc(c1)-c1ccc(N)nc1
: