Target
Mitogen-activated protein kinase 9
Ligand
BDBM104974
Substrate
Meas. Tech.
In Vitro Inhibition Assay
pH
7.5±0
Temperature
303.15±0 K
IC50
253.5±n/a nM
Citation
 Buettelmann, BGoyal, BPalmer, WS JNK modulators US Patent  US8569306 Publication Date 10/29/2013 
Target
Name:
Mitogen-activated protein kinase 9
Synonyms:
JNK-55 JNK2/JNK3 MK09_HUMAN Mitogen-activated protein kinase 8/9 SAPK1A c-Jun N-terminal kinase 2 | c-Jun N-terminal kinase 2 (JNK2)
Type:
Enzyme
Mol. Mass.:
48131.49
Organism:
Homo sapiens (Human)
Description:
JNK-2 was purchased from Upstate Cell Signaling Solutions (formerly Upstate Biotechnology).
Residue:
424
  
Inhibitor
Name:
BDBM104974
Synonyms:
US8569306, 11
Type:
Small organic molecule
Emp. Form.:
C17H19N5O
Mol. Mass.:
309.3657
SMILES:
O[C@H]1CC[C@@H](CC1)Nc1nccc(n1)-c1cnc2ccccn12
: