Target
Gamma-aminobutyric acid (GABA) B receptor 1
Ligand
BDBM104977
Substrate
Meas. Tech.
Binding Assay
IC50
32±5.19 nM
Citation
 Runyon, SPRogawski, MACook, EKepler, JNavarro, HKaminski, ROrr, M Androstane and pregnane steroids with potent allosteric GABA receptor chloride ionophore modulating properties US Patent  US8575375 Publication Date 11/5/2013 
Target
Name:
Gamma-aminobutyric acid (GABA) B receptor 1
Synonyms:
GABA-B receptor 1 Gamma-aminobutyric acid type B receptor subunit 1 (GABA) gamma-Aminobutyric Acid Type B Receptor Subunit 1
Type:
G Protein-Coupled Receptor (GPCR)
Mol. Mass.:
108221.06
Organism:
Rattus norvegicus (rat)
Description:
Q6MFX8
Residue:
960
  
Inhibitor
Name:
BDBM104977
Synonyms:
US8575375, B-5
Type:
Small organic molecule
Emp. Form.:
C20H34OS
Mol. Mass.:
322.548
SMILES:
CS[C@H]1CCC2C3CC[C@H]4C[C@H](O)CC[C@]4(C)C3CC[C@]12C
: