Target
Phosphatidylinositol 4,5-bisphosphate 3-kinase catalytic subunit delta isoform
Ligand
BDBM281514
Substrate
Meas. Tech.
PI3Kdelta Scintillation Proximity Assay
pH
6.7±n/a
Temperature
298.15±n/a K
IC50
<1000±n/a nM
Comments
extracted
Citation
 Zou, GCombs, APBuesking, AW Aza-heteroaryl compounds as PI3K-gamma inhibitors US Patent  US10022387 Publication Date 7/17/2018 
Target
Name:
Phosphatidylinositol 4,5-bisphosphate 3-kinase catalytic subunit delta isoform
Synonyms:
PI3-kinase p110 subunit delta PI3-kinase subunit p110-delta PIK3CD Phosphatidylinositol 4,5-biphosphate 3-kinase catalytic subunit delta (PIK3CD) Phosphatidylinositol 4,5-bisphosphate 3-kinase 110 kDa catalytic subunit delta (PI3K delta) Phosphatidylinositol 4,5-bisphosphate 3-kinase catalytic subunit delta (PI3Kdelta) Phosphatidylinositol 4,5-bisphosphate 3-kinase catalytic subunit delta isoform (PI3K delta) Phosphatidylinositol 4,5-bisphosphate 3-kinase catalytic subunit delta isoform (PI3K-delta) Phosphatidylinositol 4,5-bisphosphate 3-kinase catalytic subunit delta isoform (PI3Kdelta)
Type:
Enzyme Subunit
Mol. Mass.:
119489.41
Organism:
Homo sapiens (Human)
Description:
O00329
Residue:
1044
  
Inhibitor
Name:
BDBM281514
Synonyms:
N-(5-(2-(1H- Imidazol-2- yl)benzo[d]oxazol- 6-yl)pyridin-3- yl)ethanesulfonamide US10596184, Example 40 | US9586949, Example 40
Type:
Small organic molecule
Emp. Form.:
C17H15N5O3S
Mol. Mass.:
369.398
SMILES:
CCS(=O)(=O)Nc1cncc(c1)-c1ccc2nc(oc2c1)-c1ncc[nH]1
: