Target
Kappa-type opioid receptor
Ligand
BDBM50199934
Substrate
Meas. Tech.
Binding Assay
pH
7.8±0
Temperature
298.15±0 K
Ki
112±0.0 nM
Citation
 Dolle, RELe Bourdonnec, BGoodman, AJ Opioid antagonists US Patent  US8580788 Publication Date 11/12/2013 
Target
Name:
Kappa-type opioid receptor
Synonyms:
K-OR-1 Kappa-opioid receptor (KOR) Kappa-type opioid receptor (KOR) OPIATE Kappa OPRK1 kappa opioid receptor (KOR)
Type:
G Protein-Coupled Receptor (GPCR)
Mol. Mass.:
42648.76
Organism:
Homo sapiens (Human)
Description:
P41145
Residue:
380
  
Inhibitor
Name:
BDBM50199934
Synonyms:
3-((7R,8R,9alphaR)-7,8-dimethyl-2-phenethyl-octahydro-1H-pyrido[1,2-R]pyrazin-8-yl)phenol US8580788, 58
Type:
Small organic molecule
Emp. Form.:
C24H32N2O
Mol. Mass.:
364.5237
SMILES:
C[C@H]1CN2CCN(CCc3ccccc3)C[C@H]2C[C@@]1(C)c1cccc(O)c1
: