Target
P2X purinoceptor 3
Ligand
BDBM106099
Substrate
Meas. Tech.
Inhibiton Assay
IC50
4±n/a nM
Citation
 Kai, HTaoda, YEndoh, TAsahi, KTobinaga, H Pyrolinone derivative and pharmaceutical composition comprising the same US Patent  US8575197 Publication Date 11/5/2013 
Target
Name:
P2X purinoceptor 3
Synonyms:
ATP receptor P2RX3 P2X purinoceptor 3 P2X purinoceptor 3 (P2X3) P2X3 purinoceptor p2x3 + hsa
Type:
Protein
Mol. Mass.:
44292.02
Organism:
Homo sapiens (Human)
Description:
P56373
Residue:
397
  
Inhibitor
Name:
BDBM106099
Synonyms:
US8575197, II-012
Type:
Small organic molecule
Emp. Form.:
C27H27N3O3S
Mol. Mass.:
473.587
SMILES:
CC(C)(C)c1[nH]nc2C(=O)N(C(c12)c1ccccc1OCCO)c1ccc(cc1)-c1cccs1
: