Target
Adenosine receptor A2a
Ligand
BDBM106372
Substrate
Meas. Tech.
Radiological Binding Assay
pH
7.4±0
Ki
0.71±0.3 nM
Citation
 Borghini, APietra, DLeonardi, MGiorgi, IBianucci, AM N-[9-(ortho-fluorobenzyl)-2-phenyl-8-azapurin-6-yl]-amides as potent and selective ligands for A1 adenosine receptors. Chem Biol Drug Des 82:22-38 (2013)  
Target
Name:
Adenosine receptor A2a
Synonyms:
A2A adenosine receptor (hA2A) ADENOSINE A2 ADORA2 Adenosine A2A receptor (A2AAR)
Type:
G Protein-Coupled Receptor (GPCR)
Mol. Mass.:
44716.46
Organism:
Homo sapiens (Human)
Description:
P29274
Residue:
412
  
Inhibitor
Name:
BDBM106372
Synonyms:
N-[9-(ortho-fluorobenzyl)-2-phenyl-9H-8-azapurin-6-yl]-amides (3)
Type:
Small organic molecule
Emp. Form.:
C22H19FN6O
Mol. Mass.:
402.4243
SMILES:
Fc1ccccc1Cn1nnc2c(NC(=O)C3CCC3)nc(nc12)-c1ccccc1
: