Target
Microtubule-associated protein tau
Ligand
BDBM281571
Substrate
Meas. Tech.
Tau binding assay
pH
7.4±n/a
Temperature
298.15±n/a K
Ki
3.35±n/a nM
Comments
extracted
Citation
 Walji, AMHostetler, EGreshock, TJLi, JMoore, KPBennacef, IMulhearn, JSelnick, HWang, YYang, KFu, J Pyrrolo[2,3-C]pyridines as imaging agents for neurofibrilary tangles US Patent  US10022461 Publication Date 7/17/2018 
Target
Name:
Microtubule-associated protein tau
Synonyms:
MAPT MTBT1 Neurofibrillary tangle protein Paired helical filament-tau TAU_HUMAN | Tau Protein
Type:
Protein
Mol. Mass.:
78928.63
Organism:
Homo sapiens (Human)
Description:
P10636
Residue:
758
  
Inhibitor
Name:
BDBM281571
Synonyms:
US10022461, Compound 21-4
Type:
Small organic molecule
Emp. Form.:
C16H13N3O
Mol. Mass.:
263.2939
SMILES:
CC#Cc1cnc(cc1CO)-n1ccc2ccncc12
: