Target
Microtubule-associated protein tau
Ligand
BDBM281603
Substrate
Meas. Tech.
Tau binding assay
pH
7.4±n/a
Temperature
298.15±n/a K
Ki
1.02±n/a nM
Comments
extracted
Citation
 Walji, AMHostetler, EGreshock, TJLi, JMoore, KPBennacef, IMulhearn, JSelnick, HWang, YYang, KFu, J Pyrrolo[2,3-C]pyridines as imaging agents for neurofibrilary tangles US Patent  US10022461 Publication Date 7/17/2018 
Target
Name:
Microtubule-associated protein tau
Synonyms:
MAPT MTBT1 Neurofibrillary tangle protein Paired helical filament-tau TAU_HUMAN | Tau Protein
Type:
Protein
Mol. Mass.:
78928.63
Organism:
Homo sapiens (Human)
Description:
P10636
Residue:
758
  
Inhibitor
Name:
BDBM281603
Synonyms:
US10022461, Compound 53
Type:
Small organic molecule
Emp. Form.:
C15H10N4S
Mol. Mass.:
278.332
SMILES:
c1ncc(s1)-c1ccc(nc1)-n1ccc2ccncc12
: