Target
5-hydroxytryptamine 1D receptor
Ligand
BDBM106721
Substrate
Meas. Tech.
Binding Assay
IC50
5.6e+2±n/a nM
Citation
 Maddaford, SRamnauth, JRakhit, SPatman, JRenton, PAnnedi, SC Substituted indole compounds having NOS inhibitory activity US Patent  US8586620 Publication Date 11/19/2013 
Target
Name:
5-hydroxytryptamine 1D receptor
Synonyms:
5-hydroxytryptamine 1D receptor (5HT1D) | HTR1D
Type:
Protein
Mol. Mass.:
12731.52
Organism:
Bos taurus (Bovine)
Description:
Q8MI13
Residue:
119
  
Inhibitor
Name:
BDBM106721
Synonyms:
US8586620, 111
Type:
Small organic molecule
Emp. Form.:
C18H20N4O
Mol. Mass.:
308.3776
SMILES:
CN1CCC(C1)c1c[nH]c2ccc(cc12)N=C(N)c1ccco1
: