Target
Polyunsaturated fatty acid lipoxygenase ALOX12
Ligand
BDBM106774
Substrate
Meas. Tech.
IC50 Assay
pH
8±0
Temperature
296.15±0 K
IC50
>1.00e+5±n/a nM
Citation
 Mascayano, CEspinosa, VSepúlveda-Boza, SSepúlveda-Boza, EKPerry, S In vitro study of isoflavones and isoflavans as potent inhibitors of human 12- and 15-lipoxygenases. Chem Biol Drug Des 82:317-25 (2013)  
Target
Name:
Polyunsaturated fatty acid lipoxygenase ALOX12
Synonyms:
12-LOX 12LO Arachidonate 12-lipoxygenase LOG12 Platelet 12-lipoxygenase | Platelet-type lipoxygenase 12
Type:
Protein
Mol. Mass.:
75689.18
Organism:
Homo sapiens (Human)
Description:
P18054
Residue:
663
  
Inhibitor
Name:
BDBM106774
Synonyms:
3‐(4‐chlorophenyl)‐6,7‐dihydroxy‐4H‐chromen‐4‐one IR-5
Type:
Small organic molecule
Emp. Form.:
C15H9ClO4
Mol. Mass.:
288.683
SMILES:
Oc1cc2occ(-c3ccc(Cl)cc3)c(=O)c2cc1O
: