Target
Polyunsaturated fatty acid lipoxygenase ALOX15
Ligand
BDBM106784
Substrate
Meas. Tech.
IC50 Assay
pH
7.5±0
Temperature
296.15±0 K
IC50
>4.0e+4±n/a nM
Citation
 Mascayano, CEspinosa, VSepúlveda-Boza, SSepúlveda-Boza, EKPerry, S In vitro study of isoflavones and isoflavans as potent inhibitors of human 12- and 15-lipoxygenases. Chem Biol Drug Des 82:317-25 (2013)  
Target
Name:
Polyunsaturated fatty acid lipoxygenase ALOX15
Synonyms:
15-Lipoxygenase-1 (15-LOX-1) Arachidonate 15-lipoxygenase LOG15 Reticulocyte 15-lipoxygenase-1 | Sphingosine 1-phosphate receptor 1 (S1P1)
Type:
Protein
Mol. Mass.:
74804.05
Organism:
Homo sapiens (Human)
Description:
Residue:
662
  
Inhibitor
Name:
BDBM106784
Synonyms:
5,7‐dihydroxy‐3‐(4‐nitrophenyl)‐4H‐chromen‐4‐one | 5,7-Dihydroxy-4′-nitro-isoflavone (4a)
Type:
Small organic molecule
Emp. Form.:
C15H9NO6
Mol. Mass.:
299.2351
SMILES:
Oc1cc(O)c2c(c1)occ(-c1ccc(cc1)[N+]([O-])=O)c2=O
: