Target
Cyclin-dependent kinase 9
Ligand
BDBM106961
Substrate
Meas. Tech.
Kinase Assay
pH
7.5±0
Temperature
303.15±0 K
IC50
2.04e+3±n/a nM
Citation
 Sheldrake, PWAtrash, BGreen, SMcDonald, EFrame, S Trisubstituted purine derivatives US Patent  US8592581 Publication Date 11/26/2013 
Target
Name:
Cyclin-dependent kinase 9
Synonyms:
C-2K CDK9 Cell division cycle 2-like protein kinase 4 Cyclin-Dependent Kinase 9 (CDK9) Serine/threonine-protein kinase PITALRE Tat-associated kinase complex catalytic subunit
Type:
Enzyme Subunit
Mol. Mass.:
42789.13
Organism:
Homo sapiens (Human)
Description:
Residue:
372
  
Inhibitor
Name:
BDBM106961
Synonyms:
US8592581, 12
Type:
Small organic molecule
Emp. Form.:
C20H29N7O
Mol. Mass.:
383.4906
SMILES:
CC[C@H](Nc1nc(NCc2cccc(C)n2)c2ncn(C(C)C)c2n1)[C@@H](C)O
: