Target
Dipeptidyl peptidase 4
Ligand
BDBM107102
Substrate
Meas. Tech.
Enzyme Assay
IC50
1.6±0.0 nM
Citation
 Biftu, TWeber, AE Aminotetrahydropyrans as dipeptidyl peptidase-IV inhibitors for the treatment or prevention of diabetes US Patent  US8592371 Publication Date 11/26/2013 
Target
Name:
Dipeptidyl peptidase 4
Synonyms:
ADABP Adenosine deaminase complexing protein 2 CD_antigen=CD26 DPP4 DPPIV Dipeptidyl peptidase 4 (DPP IV) Dipeptidyl peptidase 4 (DPP4) Dipeptidyl peptidase 4 membrane form Dipeptidyl peptidase IV Dipeptidyl peptidase IV (DDP-IV) Dipeptidyl peptidase IV membrane form Dipeptidyl peptidase-IV (DPP-4) T-cell activation antigen CD26 | TP103
Type:
Enzyme
Mol. Mass.:
88271.01
Organism:
Homo sapiens (Human)
Description:
P27487
Residue:
766
  
Inhibitor
Name:
BDBM107102
Synonyms:
US8592371, 4 | US9278976, (3S,5R)-5-[2-(cyclopentanesulfonyl)-2H,4H,5H,6H-pyrrolo[3,4-c]pyrazol-5-yl]-2-(2,5-difluorophenyl)oxan-3-amine
Type:
Small organic molecule
Emp. Form.:
C21H26F2N4O3S
Mol. Mass.:
452.518
SMILES:
N[C@H]1C[C@H](COC1c1cc(F)ccc1F)N1Cc2cn(nc2C1)S(=O)(=O)C1CCCC1
: