Target
Probable G-protein coupled receptor 160
Ligand
BDBM281666
Substrate
Meas. Tech.
GPR120 pERK AlphaScreen SureFire Assay
Temperature
298.15±n/a K
EC50
590±n/a nM
Comments
extracted
Citation
 Shi, YWang, YCheng, PTWu, SC Cyclobutane containing carboxylic acid GPR120 modulators US Patent  US10023519 Publication Date 7/17/2018 
Target
Name:
Probable G-protein coupled receptor 160
Synonyms:
G-protein coupled receptor GPCR1 GPCR150 hGPCR1
Type:
Enzyme Catalytic Domain
Mol. Mass.:
39797.81
Organism:
Homo sapiens (Human)
Description:
Residue:
338
  
Inhibitor
Name:
BDBM281666
Synonyms:
US10023519, Example 7
Type:
Small organic molecule
Emp. Form.:
C21H24O4
Mol. Mass.:
340.4129
SMILES:
CC(C)Oc1cccc(c1)-c1ccc(cc1)[C@@H]1C[C@@H](C1)OCC(O)=O
: