Target
Probable G-protein coupled receptor 160
Ligand
BDBM281667
Substrate
Meas. Tech.
GPR120 pERK AlphaScreen SureFire Assay
Temperature
298.15±n/a K
EC50
900±n/a nM
Comments
extracted
Citation
 Shi, YWang, YCheng, PTWu, SC Cyclobutane containing carboxylic acid GPR120 modulators US Patent  US10023519 Publication Date 7/17/2018 
Target
Name:
Probable G-protein coupled receptor 160
Synonyms:
G-protein coupled receptor GPCR1 GPCR150 hGPCR1
Type:
Enzyme Catalytic Domain
Mol. Mass.:
39797.81
Organism:
Homo sapiens (Human)
Description:
Residue:
338
  
Inhibitor
Name:
BDBM281667
Synonyms:
US10023519, Example 8
Type:
Small organic molecule
Emp. Form.:
C19H16ClF3O4
Mol. Mass.:
400.776
SMILES:
OC(=O)CO[C@H]1C[C@H](C1)c1ccc(cc1)-c1cc(OC(F)(F)F)ccc1Cl
: