Target
Probable G-protein coupled receptor 160
Ligand
BDBM281668
Substrate
Meas. Tech.
GPR120 pERK AlphaScreen SureFire Assay
Temperature
298.15±n/a K
EC50
1590±n/a nM
Comments
extracted
Citation
 Shi, YWang, YCheng, PTWu, SC Cyclobutane containing carboxylic acid GPR120 modulators US Patent  US10023519 Publication Date 7/17/2018 
Target
Name:
Probable G-protein coupled receptor 160
Synonyms:
G-protein coupled receptor GPCR1 GPCR150 hGPCR1
Type:
Enzyme Catalytic Domain
Mol. Mass.:
39797.81
Organism:
Homo sapiens (Human)
Description:
Residue:
338
  
Inhibitor
Name:
BDBM281668
Synonyms:
US10023519, Example 9
Type:
Small organic molecule
Emp. Form.:
C25H24O3
Mol. Mass.:
372.4563
SMILES:
OC(=O)CO[C@H]1C[C@H](C1)c1ccc(cc1)-c1cccc(Cc2ccccc2)c1
: