Target
Probable G-protein coupled receptor 160
Ligand
BDBM281679
Substrate
Meas. Tech.
GPR120 pERK AlphaScreen SureFire Assay
Temperature
298.15±n/a K
EC50
270±n/a nM
Comments
extracted
Citation
 Shi, YWang, YCheng, PTWu, SC Cyclobutane containing carboxylic acid GPR120 modulators US Patent  US10023519 Publication Date 7/17/2018 
Target
Name:
Probable G-protein coupled receptor 160
Synonyms:
G-protein coupled receptor GPCR1 GPCR150 hGPCR1
Type:
Enzyme Catalytic Domain
Mol. Mass.:
39797.81
Organism:
Homo sapiens (Human)
Description:
Residue:
338
  
Inhibitor
Name:
BDBM281679
Synonyms:
Cis-2-(3-(2′-fluoro-5′-((6-methylpyridin-3-yl)oxy)-[1,1′-biphenyl]-4-yl)cyclobutoxy) acetic acid | US10023519, Example 20
Type:
Small organic molecule
Emp. Form.:
C24H22FNO4
Mol. Mass.:
407.4342
SMILES:
Cc1ccc(Oc2ccc(F)c(c2)-c2ccc(cc2)C2C[C@@H](C2)OCC(O)=O)cn1
: