Target
Probable G-protein coupled receptor 160
Ligand
BDBM281702
Substrate
Meas. Tech.
GPR120 pERK AlphaScreen SureFire Assay
Temperature
298.15±n/a K
EC50
210±n/a nM
Comments
extracted
Citation
 Shi, YWang, YCheng, PTWu, SC Cyclobutane containing carboxylic acid GPR120 modulators US Patent  US10023519 Publication Date 7/17/2018 
Target
Name:
Probable G-protein coupled receptor 160
Synonyms:
G-protein coupled receptor GPCR1 GPCR150 hGPCR1
Type:
Enzyme Catalytic Domain
Mol. Mass.:
39797.81
Organism:
Homo sapiens (Human)
Description:
Residue:
338
  
Inhibitor
Name:
BDBM281702
Synonyms:
2-(3-(2′-Fluoro-5′-isopropoxy-[1,1′-biphenyl]-4-yl)cyclobutyl)acetic acid US10023519, Example 44
Type:
Small organic molecule
Emp. Form.:
C21H23FO3
Mol. Mass.:
342.4039
SMILES:
CC(C)Oc1ccc(F)c(c1)-c1ccc(cc1)C1CC(CC(O)=O)C1
: